{"text_format":"1","workbook":"xlsx","n_sheets":43,"sheets":["Startup page","Main Menu","DIP Depth of Bury","DIP-Data","DIP-P-1","DIP-P-2","DIP-P-3","DIP-Assumptions","HDPE Depth of Bury","HDPE-Data","HDPE-Assumptions","PVC Depth of Bury","Flexible XSects","PVC-Accuracy","PVC-E' Values","PVC-Data","PVC-Assumptions","RCP Depth of Bury","RCP-Class D","RCP-R-1","RCP-R-2","RCP-R-3-4 0%","RCP-R-3-4 0.4%","RCP-R-3-4 1.0%","RCP-Assumptions","RCP-Transition Width","RCP-Live Load","RCAP Depth of Bury","RCAP-Transition Width","RCAP-Live Load","RCAP-R-5","RCAP-Assumptions","VCP Depth of Bury","Transition Width - VCP","VCP-Live Load-Round","VCP-Class D","VCP-R-1","VCP-R-2","VCP-R-3 0%","VCP-R-3 0.4%","VCP-R-4 0.4%","VCP-R-4 1.0%","VCP-Assumptions"],"not_rendered":{"charts":0,"images":21,"macros":1,"external_links":1,"defined_names":10,"comments":3,"pivot_tables":0},"unopened":[],"bounds":{"document_bytes":16777216,"sheet_cells":100000,"rows_first":2000,"rows_last":500,"rows_between":2000,"halvings":0,"cell_chars":16384,"cell_head_chars":4096},"cells_cut":0,"cells_raw":0,"read":"whole","date_system":"1900"}

{"sheet":"Startup page","index":0,"n_rows":0,"n_cols":0,"rows_kept":0,"cut":false,"hidden":false,"merged":[]}

{"sheet":"Main Menu","index":1,"n_rows":33,"n_cols":3,"rows_kept":33,"cut":false,"hidden":false,"merged":[]}
[]
[]
[null,null,"ALLOWABLE DEPTH OF BURY FOR PIPE"]
[null,null,"Click on pipe type for analysis"]
[]
[]
{"$rows_left_out":28}
{"sheet":"DIP Depth of Bury","index":2,"n_rows":70,"n_cols":32,"rows_kept":70,"cut":false,"hidden":false,"merged":[[32,2,33,2],[31,3,31,4],[31,5,31,6],[31,7,31,8],[11,3,11,4],[5,3,5,4],[7,3,7,4],[8,3,8,4],[9,3,9,4],[10,3,10,4]]}
[]
[]
[null,null,"Ductile Iron Pipe",null,null,null,null,null,null,null,null,null,null,"SUDAS P-1",null,null,null,null,"SUDAS P-2",null,null,null,null,"SUDAS P-3"]
[null,null,"Min / Max depth of bury with both Dead and Live Loads factored in",null,null,null,null,null,null,null,null,null,null,"Bending Moment Coefficient, Kb",{"$f":"LOOKUP(N3,'DIP-Data'!B28:B32,'DIP-Data'!E28:E32)","v":0.21},null,null,null,"Bending Moment Coefficient, Kb",{"$f":"LOOKUP(S3,'DIP-Data'!B28:B32,'DIP-Data'!E28:E32)","v":0.157},null,null,null,"Bending Moment Coefficient, Kb",{"$f":"LOOKUP(X3,'DIP-Data'!B30:B32,'DIP-Data'!E30:E32)","v":0.128}]
[null,null,null,null,null,null,null,null,null,null,null,null,null,"Deflection Coefficient, Kx",{"$f":"LOOKUP(N3,'DIP-Data'!B28:B32,'DIP-Data'!F28:F32)","v":0.105},null,null,null,"Deflection Coefficient, Kx",{"$f":"LOOKUP(S3,'DIP-Data'!B28:B32,'DIP-Data'!F28:F32)","v":9.6000000000000002E-2},null,null,null,"Deflection Coefficient, Kx",{"$f":"LOOKUP(X3,'DIP-Data'!B28:B32,'DIP-Data'!F28:F32)","v":8.5000000000000006E-2}]
[null,null,null,"User inputs",null,null,null,null,null,null,null,null,null,"Modulus of Soil Reaction, E'",300,null,null,null,"Modulus of Soil Reaction, E'",{"$f":"LOOKUP(S3,'DIP-Data'!B28:B32,'DIP-Data'!C28:C32)","v":500},null,null,null,"Modulus of Soil Reaction, E'",{"$f":"LOOKUP(X3,'DIP-Data'!B28:B32,'DIP-Data'!C28:C32)","v":700}]
{"$rows_left_out":65}
{"sheet":"DIP-Data","index":3,"n_rows":56,"n_cols":13,"rows_kept":56,"cut":false,"hidden":false,"merged":[]}
["DON’T MOVE THIS TABLE"]
["Diameter and Thickness"]
[null,null,"Casting","Thickness"]
["Diameter","OD","Allowance","PC150","PC200","PC250","PC300","PC350","TC52"]
[3,3.96,0.05,"N/A","N/A","N/A","N/A",0.25,0.28000000000000003]
[4,4.8,0.05,"N/A","N/A","N/A","N/A",0.25,0.28999999999999998]
{"$rows_left_out":51}
{"sheet":"DIP-P-1","index":4,"n_rows":22,"n_cols":2,"rows_kept":22,"cut":false,"hidden":false,"merged":[[0,0,0,6]]}
["Back to Calculations"]
[]
[]
[]
[]
[]
{"$rows_left_out":17}
{"sheet":"DIP-P-2","index":5,"n_rows":22,"n_cols":2,"rows_kept":22,"cut":false,"hidden":false,"merged":[[0,0,0,6]]}
["Back to Calculations"]
[]
[]
[]
[]
[]
{"$rows_left_out":17}
{"sheet":"DIP-P-3","index":6,"n_rows":22,"n_cols":2,"rows_kept":22,"cut":false,"hidden":false,"merged":[[0,0,0,6]]}
["Back to Calculations"]
[]
[]
[]
[]
[]
{"$rows_left_out":17}
{"sheet":"DIP-Assumptions","index":7,"n_rows":14,"n_cols":1,"rows_kept":14,"cut":false,"hidden":false,"merged":[]}
["Ductile Iron Pipe Calculation Assumptions"]
[]
["When live load is considered, an HS-20 load applied in an unpaved condition is assumed.  Impact factors are included in live load.  If the pipe will not be subjected to live load, the minimum depth of bury is assumed to be 1 foot to provide adequate cover to protect pipe from damage."]
[]
["Prism loading is assumed for the backfill load calculation"]
[]
{"$rows_left_out":9}
{"sheet":"HDPE Depth of Bury","index":8,"n_rows":37,"n_cols":16,"rows_kept":37,"cut":false,"hidden":false,"merged":[[27,2,28,2],[10,3,10,5],[11,3,11,5],[12,3,12,5],[13,3,13,5],[5,3,5,5],[7,3,7,5],[8,3,8,5],[9,3,9,5],[8,13,9,13],[8,12,9,12]]}
[]
[]
[null,null,"HDPE Pipe"]
[null,null,"Min / Max depth of bury with both Dead and Live Loads factored in"]
[]
[null,null,null,"User inputs"]
{"$rows_left_out":32}
{"sheet":"HDPE-Data","index":9,"n_rows":127,"n_cols":42,"rows_kept":127,"cut":false,"hidden":false,"merged":[[25,2,25,3],[1,35,1,36]]}
[]
["Deflection check",null,null,null,"AASHTO Live Load Determination",null,null,null,"Wall Thrust",null,null,null,null,null,null,null,null,null,null,"Wall Buckling",null,null,"Bending Stress",null,null,"Bending Strain",null,null,null,null,"Pipe","Outside",null,"Mean dia.","Sect. Area","Shape factor",null,null,null,"Geostatic Load","Class 1","Class 1"]
[null,null,null,null,null,null,null,null,"",null,null,null,null,null,null,null,null,null,null,null,null,null,null,null,null,null,null,null,null,"Diameter","Stiffness","Diameter","c","Dm","As","E'=1000","E'=3000",null,null,"Psp, psi","Uncompacted","Compacted"]
["Pipe Diameter",{"$f":"'HDPE Depth of Bury'!D8","v":15},null,null,"AASTHO  Tire Distribution",null,null,null,"Unit weight of soil",{"$f":"'HDPE Depth of Bury'!D11","v":120},"pcf",null,null,null,null,null,null,null,null,"PS",{"$f":"'HDPE Depth of Bury'!D18","v":42},null,"Diameter",{"$f":"'HDPE Depth of Bury'!D8","v":15},null,"Diameter",{"$f":"'HDPE Depth of Bury'!D8","v":15},null,null,4,35,4.7,0.13900000000000001,{"$f":"AD4+2*AG4","v":4.2780000000000005},4.48E-2,3.8,4.5999999999999996,null,null,1.04,470,2350]
["Pipe OD",{"$f":"LOOKUP(B4,AD4:AD17,AF4:AF17)","v":17.7},"inches",null,"W",{"$f":"20/12","v":1.6666666666666667},"ft",null,"Diameter",{"$f":"B4","v":15},null,null,null,null,null,null,null,null,null,"Diameter, in.",{"$f":"'HDPE Depth of Bury'!D8","v":15},null,"OD",{"$f":"LOOKUP(X4,AD4:AD17,AF4:AF17)","v":17.7},null,"OD",{"$f":"LOOKUP(X4,AD4:AD17,AF4:AF17)","v":17.7},null,null,6,35,7,0.192,6.3840000000000003,5.6800000000000003E-2,3.8,4.5999999999999996,null,null,5.21,520,3450]
["PS",{"$f":"'HDPE Depth of Bury'!D18","v":42},"psi",null,"L",{"$f":"10/12","v":0.83333333333333337},"ft",null,"Outside Diameter",{"$f":"B5","v":17.7},"in2 / in",null,null,null,null,null,null,null,null,"Outside Diam., in.",{"$f":"LOOKUP(U5,AD4:AD17,AF4:AF17)","v":17.7},null,"Dm",{"$f":"LOOKUP(X4,AD4:AD17,AH4:AH17)","v":15.9},null,"Dm",{"$f":"LOOKUP(X4,AD4:AD17,AH4:AH17)","v":15.9},null,null,8,35,9.9,0.29699999999999999,8.5939999999999994,8.3699999999999997E-2,3.8,4.5999999999999996,null,null,10.42,570,4200]
{"$rows_left_out":122}
{"sheet":"HDPE-Assumptions","index":10,"n_rows":9,"n_cols":1,"rows_kept":9,"cut":false,"hidden":false,"merged":[]}
["HDPE Pipe Calculation Assumptions"]
[]
["When live load is considered, an HS-20 load applied in an unpaved condition is assumed.  If the pipe will not be subjected to live load, the minimum depth of bury is assumed to be 2 feet to provide adequate cover to protect pipe from damage.  "]
[]
["Prism loading is assumed for the backfill load calculation"]
[]
{"$rows_left_out":4}
{"sheet":"PVC Depth of Bury","index":11,"n_rows":35,"n_cols":17,"rows_kept":35,"cut":false,"hidden":false,"merged":[[5,3,5,5],[18,3,18,4],[18,6,19,6],[19,3,19,4],[25,2,26,2],[7,3,7,5],[8,3,8,5],[9,3,9,5],[10,3,10,5],[11,3,11,5],[12,3,12,5],[13,3,13,5],[17,3,17,4]]}
[]
[]
[null,null,"PVC Pipe"]
[null,null,"Min / Max depth of bury with both Dead and Live Loads factored in",null,null,null,null,null,null,null,null,null,null,"AWWA C900 - DR14",813,null,"Yes"]
[null,null,null,null,null,null,null,null,null,null,null,null,null,"AWWA C900 - DR18",364,null,"No"]
[null,null,null,"User Inputs",null,null,null,null,null,null,null,null,null,"AWWA C900 - DR21",223.5]
{"$rows_left_out":30}
{"sheet":"Flexible XSects","index":12,"n_rows":26,"n_cols":11,"rows_kept":26,"cut":false,"hidden":false,"merged":[[0,0,0,13]]}
["Back to Calculations"]
[]
[]
[]
[]
[]
{"$rows_left_out":21}
{"sheet":"PVC-Accuracy","index":13,"n_rows":18,"n_cols":7,"rows_kept":18,"cut":false,"hidden":false,"merged":[[17,2,17,6],[16,2,16,6]]}
[]
[]
[null,null,"Back to Calculations"]
[null,null,"Average Modulus of Soil Reaction, E'"]
[]
[null,null,null,"E' for Degree of Compaction of Bedding \nin pounds per square inch"]
{"$rows_left_out":13}
{"sheet":"PVC-E' Values","index":14,"n_rows":18,"n_cols":7,"rows_kept":18,"cut":false,"hidden":false,"merged":[[17,2,17,6],[16,2,16,6]]}
[]
[]
[null,null,"Back to Calculations"]
[null,null,"Average Modulus of Soil Reaction, E'"]
[]
[null,null,null,"E' for Degree of Compaction of Bedding \nin pounds per square inch"]
{"$rows_left_out":13}
{"sheet":"PVC-Data","index":15,"n_rows":61,"n_cols":6,"rows_kept":61,"cut":false,"hidden":false,"merged":[[10,2,10,3]]}
["AASHTO Live Load Determination"]
[]
["AASTHO  Tire Distribution"]
["W",{"$f":"20/12","v":1.6666666666666667},"sf"]
["L",{"$f":"10/12","v":0.83333333333333337},"sf"]
["alpha",1]
{"$rows_left_out":56}
{"sheet":"PVC-Assumptions","index":16,"n_rows":9,"n_cols":1,"rows_kept":9,"cut":false,"hidden":false,"merged":[]}
["PVC Pipe Calculation Assumptions"]
[]
["When live load is considered, an HS-20 load applied in an unpaved condition is assumed.  If the pipe will not be subjected to live load, the minimum depth of bury is assumed to be 2 feet to provide adequate cover to protect pipe from damage.  "]
[]
["Prism loading is assumed for the backfill load calculation"]
[]
{"$rows_left_out":4}
{"sheet":"RCP Depth of Bury","index":17,"n_rows":46,"n_cols":44,"rows_kept":46,"cut":false,"hidden":false,"merged":[[10,3,10,5],[11,3,11,5],[12,3,12,5],[5,3,5,5],[7,3,7,5],[8,3,8,5],[9,3,9,5],[22,11,22,12],[22,13,22,14],[22,3,22,4],[22,5,22,6],[22,7,22,8],[22,9,22,10]]}
[]
[]
[null,null,"Reinforced Concrete Pipe"]
[null,null,"Min / Max depth of bury with both Dead and Live Loads factored in",null,null,null,null,null,null,null,null,null,null,null,null,null,null,null,null,null,null,null,null,null,null,null,null,null,null,null,null,null,null,null,null,"Class III (SUDAS Default)",1350,"  (Iowa DOT: 2000D)",null,null,"0.110 - Wet Clay",0.11,null,"Yes"]
[null,null,null,null,null,null,null,null,null,null,null,null,null,null,null,null,null,null,null,null,null,"Type D","Type C","Type B","Type A","Type A","Type A",null,null,null,null,null,null,null,null,"Class IV",2000,"  (Iowa DOT: 3000D)",null,null,"0.130 - Dry Clay",0.13,null,"No"]
[null,null,null,"User inputs",null,null,null,null,null,null,null,null,null,null,null,null,null,null,null,null,"H / Load Factor",1.1000000000000001,1.5,1.9,2.8,3.4,4.8,null,"Cd","Calculated Trench Load","Load at transition width","Controlling Earth Load","Live Load","Total Load",null,"Class V",3000,"  (Iowa DOT: 4000D)",null,null,"0.150- Saturated Topsoil",0.15]
{"$rows_left_out":41}
{"sheet":"RCP-Class D","index":18,"n_rows":26,"n_cols":2,"rows_kept":26,"cut":false,"hidden":false,"merged":[[0,0,0,6]]}
["Back to Calculations"]
[]
[]
[]
[]
[]
{"$rows_left_out":21}
{"sheet":"RCP-R-1","index":19,"n_rows":25,"n_cols":2,"rows_kept":25,"cut":false,"hidden":false,"merged":[[0,0,0,6]]}
["Back to Calculations"]
[]
[]
[]
[]
[]
{"$rows_left_out":20}
{"sheet":"RCP-R-2","index":20,"n_rows":25,"n_cols":3,"rows_kept":25,"cut":false,"hidden":false,"merged":[[0,0,0,7]]}
["Back to Calculations"]
[]
[]
[]
[]
[]
{"$rows_left_out":20}
{"sheet":"RCP-R-3-4 0%","index":21,"n_rows":24,"n_cols":6,"rows_kept":24,"cut":false,"hidden":false,"merged":[[0,0,0,13]]}
["Back to Calculations"]
[]
[]
[]
[]
[]
{"$rows_left_out":19}
{"sheet":"RCP-R-3-4 0.4%","index":22,"n_rows":25,"n_cols":6,"rows_kept":25,"cut":false,"hidden":false,"merged":[[0,0,0,12]]}
["Back to Calculations"]
[]
[]
[]
[]
[]
{"$rows_left_out":20}
{"sheet":"RCP-R-3-4 1.0%","index":23,"n_rows":25,"n_cols":6,"rows_kept":25,"cut":false,"hidden":false,"merged":[[0,0,0,13]]}
["Back to Calculations"]
[]
[]
[]
[]
[]
{"$rows_left_out":20}
{"sheet":"RCP-Assumptions","index":24,"n_rows":11,"n_cols":1,"rows_kept":11,"cut":false,"hidden":false,"merged":[]}
["RCP Calculation Assumptions"]
[]
["When live load is considered, an HS-20 load applied in an unpaved condition is assumed.  If the pipe will not be subjected to live load, the minimum depth of bury does not apply.  "]
[]
["The D0.01 pipe strength is used with a factor of safety of 1.0."]
[]
{"$rows_left_out":6}
{"sheet":"RCP-Transition Width","index":25,"n_rows":38,"n_cols":43,"rows_kept":38,"cut":false,"hidden":false,"merged":[]}
[]
["BACKFILL LOADS ON CIRCULAR RIGID PIPE AT TRANITION WIDTH"]
["100 pcf backfill material*"]
[]
[null,null,null,"Height of Backfill H above top of pipe, feet"]
[null,null,null,1,2,3,4,5,6,7,8,9,10,11,12,13,14,15,16,17,18,19,20,21,22,23,24,25,26,27,28,29,30,31,32,33,34,35,36,37,38,39,40]
{"$rows_left_out":33}
{"sheet":"RCP-Live Load","index":26,"n_rows":23,"n_cols":18,"rows_kept":23,"cut":false,"hidden":false,"merged":[[4,3,4,12]]}
["Highway Loads on Circular Pipe"]
["(From 2000 ACPA Concrete Pipe Design Manual - Table 42)"]
[]
[]
["Pipe Diameter","Do",null,"Height of Fill Above Top of Pipe in Feet",null,null,null,null,null,null,null,null,null,null,null,null,null,"All"]
[null,null,null,0.5,1,1.5,2,2.5,3,3.5,4,5,6,7,8,9]
{"$rows_left_out":18}
{"sheet":"RCAP Depth of Bury","index":27,"n_rows":46,"n_cols":43,"rows_kept":46,"cut":false,"hidden":false,"merged":[[5,3,5,4],[23,2,24,2],[8,3,8,4],[9,3,9,4],[10,3,10,4],[11,3,11,4],[12,3,12,4],[13,3,13,4],[22,3,22,4]]}
[]
[]
[null,null,"Reinforced Concrete Arch Pipe",null,null,null,null,null,null,null,null,null,null,null,null,null,null,null,null,null,null,null,null,null,null,null,null,null,null,null,"Wall","Outside","Outside"]
[null,null,"Min / Max depth of bury with both Dead and Live Loads factored in",null,null,null,null,null,null,null,null,null,null,null,null,null,null,null,null,null,null,null,null,null,null,null,null,"Equivalent Diameter","Span","Rise","Thickness","Span","Rise",null,"Class III - SUDAS default",1350,"  (Iowa DOT: 2000D)",null,null,"Yes",null,"0.110 - Wet Clay",0.11]
[null,null,null,null,null,null,null,null,null,null,null,null,null,"Type D","Type C","Type B","Type A","Type A","Type A",null,null,null,null,null,null,null,null,15,18,11,2.25,{"$f":"(AC5+2*AE5)/12","v":1.875},{"$f":"(AD5+2*AE5)/12","v":1.2916666666666667},null,"Class IV",2000,"  (Iowa DOT: 3000D)",null,null,"No",null,"0.130 - Dry Clay",0.13]
[null,null,null,"User Inputs",null,null,null,null,null,null,null,null,"H / Load Factor",1.1000000000000001,1.5,1.9,2.8,3.4,4.8,null,"Cd","Calculated Trench Load","Load at transition width","Controlling Earth Load","Live Load","Total Load",null,18,22,13,2.5,2.25,1.5,null,null,null,null,null,null,null,null,"0.150- Saturated Topsoil",0.15]
{"$rows_left_out":41}
{"sheet":"RCAP-Transition Width","index":28,"n_rows":58,"n_cols":45,"rows_kept":58,"cut":false,"hidden":false,"merged":[]}
[]
["BACKFILL LOADS ON CIRCULAR RIGID PIPE AT TRANITION WIDTH"]
["100 pcf backfill material*"]
[]
[null,null,null,null,null,"Height of Backfill H above top of pipe, feet"]
[null,null,null,null,null,1,2,3,4,5,6,7,8,9,10,11,12,13,14,15,16,17,18,19,20,21,22,23,24,25,26,27,28,29,30,31,32,33,34,35,36,37,38,39,40]
{"$rows_left_out":53}
{"sheet":"RCAP-Live Load","index":29,"n_rows":18,"n_cols":22,"rows_kept":18,"cut":false,"hidden":false,"merged":[[4,7,4,16]]}
["Highway Loads on Arch Pipe"]
["(From 2000 ACPA Concrete Pipe Design Manual - Table 42)"]
[]
[null,null,null,null,null,null,null,null,8,null,10,null,12,null,14,15,16,17,18,19]
["Equiv. Pipe Diameter","Span","Rise",null,null,null,null,"Height of Fill Above Top of Pipe in Feet",null,null,null,null,null,null,null,null,null,null,null,null,null,"All"]
[null,null,null,null,null,null,null,0.5,1,1.5,2,2.5,3,3.5,4,5,6,7,8,9]
{"$rows_left_out":13}
{"sheet":"RCAP-R-5","index":30,"n_rows":24,"n_cols":2,"rows_kept":24,"cut":false,"hidden":false,"merged":[[0,0,0,6]]}
["Back to Calculations"]
[]
[]
[]
[]
[]
{"$rows_left_out":19}
{"sheet":"RCAP-Assumptions","index":31,"n_rows":11,"n_cols":1,"rows_kept":11,"cut":false,"hidden":false,"merged":[]}
["Reinforced Concrete Arch Pipe Calculation Assumptions"]
[]
["When live load is considered, an HS-20 load applied in an unpaved condition is assumed.  If the pipe will not be subjected to live load, the minimum depth of bury does not apply.  "]
[]
["The D0.01 pipe strength is used with a factor of safety of 1.0."]
[]
{"$rows_left_out":6}
{"sheet":"VCP Depth of Bury","index":32,"n_rows":36,"n_cols":45,"rows_kept":36,"cut":false,"hidden":false,"merged":[[26,2,27,2],[7,3,7,5],[8,3,8,5],[9,3,9,5],[10,3,10,5],[11,3,11,5],[25,3,25,4],[14,3,14,5],[15,3,15,5],[5,3,5,5],[25,11,25,12],[25,13,25,14],[25,15,25,16],[25,5,25,6],[25,7,25,8],[25,9,25,10]]}
[]
[]
[null,null,"Vitrified Clay Pipe"]
[null,null,"Min / Max depth of bury with both Dead and Live Loads factored in"]
[null,null,null,null,null,null,null,null,null,null,null,null,null,null,null,null,null,null,null,null,null,"Type D","Type C","Type B","Type A","Type A","Type A"]
[null,null,null,"User Inputs",null,null,null,null,null,null,null,null,null,null,null,null,null,null,null,null,"H / Load Factor",1.1000000000000001,1.5,1.9,2.8,3.4,4.5,null,"Cd","Calculated Trench Load","Load at transition width","Controlling Earth Load","Live Load","Total Load",null,null,"Pipe Properties",null,null,null,null,null,null,"0.110 - Wet Clay",0.11]
{"$rows_left_out":31}
{"sheet":"Transition Width - VCP","index":33,"n_rows":33,"n_cols":33,"rows_kept":33,"cut":false,"hidden":false,"merged":[]}
[]
["BACKFILL LOADS ON CIRCULAR RIGID PIPE AT TRANITION WIDTH"]
["100 pcf backfill material*"]
[]
[null,null,null,"Height of Backfill H above top of pipe, feet"]
[null,null,null,1,2,3,4,5,6,7,8,9,10,11,12,13,14,15,16,17,18,19,20,21,22,23,24,25,26,27,28,29,30]
{"$rows_left_out":28}
{"sheet":"VCP-Live Load-Round","index":34,"n_rows":24,"n_cols":16,"rows_kept":24,"cut":false,"hidden":false,"merged":[[6,3,6,12],[4,0,4,15]]}
["Highway Loads on Circular Pipe"]
["(Based upon design methodolgy in 2000 ACPA Concrete Pipe Design Manual)"]
[]
[]
["The following table uses the design methodology laid out in the ACPA manual for live load.  The table matches the ACPA table, except the bottom left section of the table differs from the ACPA manual.  Numerous checks were done, it appears that there is an error in the ACPA manual.  This table is more conservative than the ACPA table."]
[]
{"$rows_left_out":19}
{"sheet":"VCP-Class D","index":35,"n_rows":25,"n_cols":2,"rows_kept":25,"cut":false,"hidden":false,"merged":[[0,0,0,6]]}
["Back to Calculations"]
[]
[]
[]
[]
[]
{"$rows_left_out":20}
{"sheet":"VCP-R-1","index":36,"n_rows":25,"n_cols":2,"rows_kept":25,"cut":false,"hidden":false,"merged":[[0,0,0,6]]}
["Back to Calculations"]
[]
[]
[]
[]
[]
{"$rows_left_out":20}
{"sheet":"VCP-R-2","index":37,"n_rows":25,"n_cols":3,"rows_kept":25,"cut":false,"hidden":false,"merged":[[0,0,0,7]]}
["Back to Calculations"]
[]
[]
[]
[]
[]
{"$rows_left_out":20}
{"sheet":"VCP-R-3 0%","index":38,"n_rows":23,"n_cols":2,"rows_kept":23,"cut":false,"hidden":false,"merged":[[0,0,0,7]]}
["Back to Calculations"]
[]
[]
[]
[]
[]
{"$rows_left_out":18}
{"sheet":"VCP-R-3 0.4%","index":39,"n_rows":24,"n_cols":2,"rows_kept":24,"cut":false,"hidden":false,"merged":[[0,0,0,7]]}
["Back to Calculations"]
[]
[]
[]
[]
[]
{"$rows_left_out":19}
{"sheet":"VCP-R-4 0.4%","index":40,"n_rows":25,"n_cols":3,"rows_kept":25,"cut":false,"hidden":false,"merged":[[0,0,0,7]]}
["Back to Calculations"]
[]
[]
[]
[]
[]
{"$rows_left_out":20}
{"sheet":"VCP-R-4 1.0%","index":41,"n_rows":25,"n_cols":3,"rows_kept":25,"cut":false,"hidden":false,"merged":[[0,0,0,7]]}
["Back to Calculations"]
[]
[]
[]
[]
[]
{"$rows_left_out":20}
{"sheet":"VCP-Assumptions","index":42,"n_rows":11,"n_cols":1,"rows_kept":11,"cut":false,"hidden":false,"merged":[]}
["VCP Calculation Assumptions"]
[]
["When live load is considered, an HS-20 load applied in an unpaved condition is assumed.  If the pipe will not be subjected to live load, the minimum depth of bury does not apply.  "]
[]
["Pipe strength is for Extra Strength VCP per ASTM C 700"]
[]
{"$rows_left_out":5}